{"text_format":"1","workbook":"xlsx","n_sheets":22,"sheets":["Application Information","Definitions","Racial Equity Statement","Table of Contents","Threshold Requirements ","Applicant Info","Eligibility","Proj Description","Proj Info (A)","Proj Info (B)","Proj Info (C)","Proj Info (D)","Proj Info (E)"," Needs Analysis","Proposed Goals","Project Budget","Budget Summary","Capacity and Experience","Certification","Project Budget SS","Project Budget TBRA","Factors."],"not_rendered":{"charts":0,"images":2,"macros":1,"external_links":0,"defined_names":35,"comments":1,"pivot_tables":0},"unopened":[],"bounds":{"document_bytes":16777216,"sheet_cells":100000,"rows_first":2000,"rows_last":500,"rows_between":2000,"halvings":0,"cell_chars":16384,"cell_head_chars":4096},"cells_cut":0,"cells_raw":0,"read":"whole","date_system":"1900"}

{"sheet":"Application Information","index":0,"n_rows":99,"n_cols":10,"rows_kept":99,"cut":false,"hidden":false,"merged":[[98,3,98,5],[27,2,27,11],[30,5,30,7],[31,5,31,7],[31,9,38,9],[32,5,32,7],[33,5,33,7],[34,5,34,7],[35,5,35,7],[36,5,36,7],[38,5,38,7],[39,5,39,7],[42,2,42,11],[43,2,43,11],[44,2,44,11],[45,2,45,11],[26,2,26,10],[11,3,11,7],[11,8,11,9],[14,2,14,11],[15,2,15,11],[16,2,16,11],[18,2,18,11],[19,2,19,11],[21,2,21,11],[22,2,22,11],[23,2,23,11],[25,2,25,11],[3,2,3,11],[4,2,4,11],[6,2,6,11],[9,2,9,11],[10,3,10,7],[10,8,10,9]]}
[]
[]
[]
[null,null,"MISSISSIPPI HOME CORPORATION"]
[null,null,"HOME-ARP APPLICATION"]
[]
[null,null,"Supportive Services (SS) and Tenant-Based Rental Assistance (TBRA)"]
[]
[null,null,"APPLICATION CYCLE"]
[null,null,"Applications for the HOME-ARP Supportive Service (SS) and TBRA Programs will be accepted during the application cycle stated below.  Applications will only be accepted during the designated dates and time.  There will not be any exceptions for late applications."]
{"$rows_left_out":90}
{"sheet":"Definitions","index":1,"n_rows":13,"n_cols":7,"rows_kept":13,"cut":false,"hidden":false,"merged":[[13,3,13,13],[2,2,2,13],[3,2,3,13],[5,2,5,13],[7,2,7,12],[8,2,8,5],[8,6,10,13]]}
[]
[]
[null,null,"HOME-ARP PROGRAM"]
[null,null,"Supportive Services (SS) and Tenant-Based Rental Assistance (TBRA) "]
[]
[null,null,"Definitions"]
[]
[]
[null,null,"Qualifying Population (QP)",null,null,null,"Homeless, as defined in section 103(a) of the McKinney-Vento Homeless Assistance Act (42 U.S.C. 11302(a));\n\nAt-risk of homelessness, as defined in section 401(1) of the McKinney-Vento Homeless Assistance Act (42 U.S.C. 11360(1));\n\nFleeing, or attempting to flee, domestic violence, dating violence, sexual assault, stalking, or human trafficking, as defined by the Secretary;\n\nIn other populations where providing supportive services or assistance under section 212(a) of the Act (42 U.S.C. 12742(a)) would prevent the family’s homelessness or would serve those with the greatest risk of housing instability (reentry, homeless youth);\n\nVeterans and families that include a veteran family member that meet one of the preceding criteria."]
[]
{"$rows_left_out":4}
{"sheet":"Racial Equity Statement","index":2,"n_rows":81,"n_cols":4,"rows_kept":81,"cut":false,"hidden":false,"merged":[[26,2,26,11],[27,2,27,11],[80,3,80,5],[18,2,18,10],[19,2,19,11],[20,2,20,11],[21,2,21,11],[24,2,24,11],[25,2,25,11],[17,2,17,11],[3,2,3,12],[4,2,4,12],[6,2,6,12],[8,2,13,12],[16,2,16,11]]}
[]
[]
[]
[null,null,"HOME-ARP PROGRAM"]
[null,null,"Supportive Services (SS) and Tenant-Based Rental Assistance (TBRA) "]
[null,"III.   RACIAL EQUITY STATEMENT"]
[null,null,"Advancing Racial Equity and Inclusion Statement"]
[]
[null,null,"MHC directs that grantees should prioritize the advancement of racial equity and inclusion at all levels of the homeless response system. Subrecipients should provide for and improve access to services,  services provision, and outcomes among disproportionately underrepresented populations. Subrecipients cannot simply rely on delivering a standardized set of services to address equity and inclusion. Subrecipients are responsible for examining their data, ensuring all eligible persons are receiving equitable supportive services with dignity, respect, and compassion regardless of their circumstances, abilities, or identity. Subrecipients must respond to disproportionality in access to services, service provision and outcomes and should seek to the voices of disproportionately impacted communities and those with lived experience of homelessness are centered in a meaningful, sustained way in creating effective approaches to reducing and ending homelessness. "]
[]
{"$rows_left_out":72}
{"sheet":"Table of Contents","index":3,"n_rows":67,"n_cols":11,"rows_kept":67,"cut":false,"hidden":false,"merged":[[66,5,66,12],[24,5,24,13],[41,5,41,13],[58,5,58,12],[60,5,60,12],[62,5,62,12],[64,5,64,12],[18,5,20,12],[3,2,3,12],[4,2,4,12],[6,2,6,12],[8,2,8,12],[10,2,10,12]]}
[]
[]
[]
[null,null,"HOME-ARP PROGRAM"]
[null,null,"Supportive Services (SS) and Tenant-Based Rental Assistance (TBRA) "]
[]
[null,null,"TABLE OF CONTENTS & REQUIRED ATTACHMENTS"]
[]
[null,null,"The following documents must be submitted with the application.  All items indexed must be tabbed and numbered accordingly.  "]
[]
{"$rows_left_out":58}
{"sheet":"Threshold Requirements ","index":4,"n_rows":22,"n_cols":5,"rows_kept":22,"cut":false,"hidden":false,"merged":[[19,2,19,3],[19,4,19,13],[20,2,20,3],[20,4,20,13],[21,2,21,3],[21,4,21,13],[16,2,16,3],[16,4,16,13],[17,2,17,3],[17,4,17,13],[18,2,18,3],[18,4,18,13],[13,2,13,3],[13,4,13,13],[14,2,14,3],[14,4,14,13],[15,2,15,3],[15,4,15,13],[12,2,12,3],[12,4,12,13],[2,2,2,13],[3,2,3,13],[5,2,5,13],[7,2,7,13],[8,2,8,3],[8,4,8,8],[9,2,9,3],[10,2,10,3],[10,4,10,9],[11,2,11,3],[11,4,11,13]]}
[]
[]
[null,null,"HOME-ARP PROGRAM"]
[null,null,"Supportive Services (SS) and Tenant-Based Rental Assistance (TBRA) "]
[]
[null,null,"Threshold Requirements "]
[]
[null,null,"Applicants must meet all of the following criteria:"]
[null,null,1,null,"The applicant is an eligible applicant."]
[null,null,2,null,"The applicant is registered with sam.gov and provides a unique entity identifier (UEI)."]
{"$rows_left_out":13}
{"sheet":"Applicant Info","index":5,"n_rows":131,"n_cols":17,"rows_kept":131,"cut":false,"hidden":false,"merged":[[114,3,114,5],[114,6,114,9],[114,10,114,16],[115,3,115,5],[115,6,115,9],[115,10,115,16],[112,3,112,5],[112,6,112,9],[112,10,112,16],[113,3,113,5],[113,6,113,9],[113,10,113,16],[110,3,110,5],[110,6,110,9],[110,10,110,16],[111,3,111,5],[111,6,111,9],[111,10,111,16],[108,3,108,5],[108,6,108,9],[108,10,108,16],[109,3,109,5],[109,6,109,9],[109,10,109,16],[106,3,106,5],[106,6,106,9],[106,10,106,16],[107,3,107,5],[107,6,107,9],[107,10,107,16],[104,3,104,5],[104,6,104,9],[104,10,104,16],[105,3,105,5],[105,6,105,9],[105,10,105,16],[102,3,102,5],[102,6,102,9],[102,10,102,16],[103,3,103,5],[103,6,103,9],[103,10,103,16],[95,3,95,5],[95,6,95,9],[95,10,95,12],[95,13,95,15],[99,3,99,16],[101,3,101,5],[101,6,101,9],[101,10,101,16],[93,3,93,5],[93,6,93,9],[93,10,93,12],[93,13,93,15],[94,3,94,5],[94,6,94,9],[94,10,94,12],[94,13,94,15],[91,3,91,5],[91,6,91,9],[91,10,91,12],[91,13,91,15],[92,3,92,5],[92,6,92,9],[92,10,92,12],[92,13,92,15],[89,3,89,5],[89,6,89,9],[89,10,89,12],[89,13,89,15],[90,3,90,5],[90,6,90,9],[90,10,90,12],[90,13,90,15],[87,3,87,5],[87,6,87,9],[87,10,87,12],[87,13,87,15],[88,3,88,5],[88,6,88,9],[88,10,88,12],[88,13,88,15],[85,3,85,5],[85,6,85,9],[85,10,85,12],[85,13,85,15],[86,3,86,5],[86,6,86,9],[86,10,86,12],[86,13,86,15],[72,4,72,10],[80,6,80,7],[83,3,83,16],[84,3,84,5],[84,6,84,9],[84,10,84,12],[64,4,64,16],[66,4,66,7],[66,9,66,10],[67,9,67,10],[68,4,68,7],[70,4,70,7],[51,4,51,7],[51,9,51,10],[52,9,52,10],[53,4,53,7],[55,4,55,7],[57,4,57,10],[33,4,33,7],[33,14,33,16],[35,4,35,9],[44,3,44,16],[49,4,49,16],[24,4,24,7],[24,9,24,10],[25,4,25,16],[27,4,27,7],[27,10,27,16],[29,4,29,7],[29,13,29,16],[23,4,23,7],[23,9,23,10],[14,3,14,16],[15,3,15,7],[15,10,15,16],[19,4,19,10],[19,12,19,13],[19,14,19,16],[31,13,31,16],[3,3,3,16],[4,3,4,16],[5,3,5,16],[7,2,7,17],[9,2,9,16],[11,4,11,6],[21,4,21,7],[21,9,21,10],[22,4,22,7],[22,9,22,10]]}
[]
[]
[]
[null,null,null,"MISSISSIPPI HOME CORPORATION"]
[null,null,null,"735 Riverside Drive |  Jackson  |  MS  |  39056"]
[null,null,null,"HOME-ARP APPLICATION"]
[]
[null,null,"Supportive Services and Tenant Based Rental Assistance"]
[]
[null,null,"I.   APPLICANT INFORMATION"]
{"$rows_left_out":122}
{"sheet":"Eligibility","index":6,"n_rows":26,"n_cols":16,"rows_kept":26,"cut":false,"hidden":false,"merged":[[21,3,21,11],[22,3,22,11],[23,3,23,11],[24,3,24,11],[25,3,25,11],[20,3,20,11],[3,1,3,15],[10,3,10,11],[11,3,11,11],[12,3,12,11],[13,3,13,11],[14,3,14,11],[15,3,15,11],[16,3,16,11],[17,3,17,11],[18,3,18,11],[19,3,19,11]]}
[]
[null,{"$f":"'Applicant Info'!D6","v":"HOME-ARP APPLICATION"},null,null,null,null,null,null,null,null,null,null,null,null,null,{"$f":"IF('Applicant Info'!E12=\"\",\"\",'Applicant Info'!E12)","v":"FY 2024 "}]
[]
[null,"II.   ELIGIBILITY"]
[null,null,null,null,null,null,null,null,null,null,null,null,null,null,{"$f":"'Applicant Info'!C8","v":"Supportive Services and Tenant Based Rental Assistance"}]
[]
[null,null,{"$f":"IF('Applicant Info'!E20=\"\",\"\",'Applicant Info'!E20)","v":""}]
[]
[null,null,"Answer the following questions:"]
[null,null,null,null,null,null,null,null,null,null,null,null,"Yes","No","N/A"]
{"$rows_left_out":17}
{"sheet":"Proj Description","index":7,"n_rows":44,"n_cols":12,"rows_kept":44,"cut":false,"hidden":false,"merged":[[3,1,3,11],[8,2,8,10],[9,2,40,10],[42,3,42,9],[43,3,43,9]]}
[]
[null,{"$f":"'Applicant Info'!D6","v":"HOME-ARP APPLICATION"},null,null,null,null,null,null,null,null,null,{"$f":"IF('Applicant Info'!E12=\"\",\"\",'Applicant Info'!E12)","v":"FY 2024 "}]
[]
[null,"III.   PROJECT DESCRIPTION"]
[null,"","Program Plan and Narratives (10 pts.)",null,null,null,null,null,null,null,{"$f":"'Applicant Info'!C8","v":"Supportive Services and Tenant Based Rental Assistance"}]
[]
[null,null,{"$f":"('Applicant Info'!E20)","v":0}]
[]
[null,null,"Describe your proposed project: include project goals, expected outcomes and measures, gaps you intend to fill in the community, and partnerships established to effectively operate the project. Cite specific, local evidence of the needs for the services proposed using PIT data and other available data."]
[]
{"$rows_left_out":35}
{"sheet":"Proj Info (A)","index":8,"n_rows":30,"n_cols":20,"rows_kept":30,"cut":false,"hidden":false,"merged":[[3,1,3,2],[5,1,5,5]]}
[]
[null,{"$f":"'Applicant Info'!D6","v":"HOME-ARP APPLICATION"},null,null,null,{"$f":"'Applicant Info'!E12","v":"FY 2024 "}]
[]
[null,"IV.  PROJECT INFO (Section A)",null,null,null,null,null,null,null,null,null,null,null,null,null,null,null,null,null,0]
[null,null,null,null,null,"Supportive Services  "]
[null,"The following activities are supportive services activities eligible under the McKinney-Vento Act and ESG Homeless Prevension Supportive Services. \n\n "]
[null,null,"Identify activities that you propose to provide using HOME-ARP funds."]
[null,null,"SEC.425.[42 u.s.c. 11385]","Yes","No","N/A"]
[null,null,"Child Care"]
[null,null,"The costs of child care for program participants, including providing meals and snacks, and comprehensive and coordinated developmental activities, are eligible. The child care center must be licensed\nby the jurisdiction in which it operates in order for its costs to be eligible. The following conditions also apply: \n     - Children must be under the age of 13 unless the children have a disability.\n     - Children with a disability must be under the age of 18. "]
{"$rows_left_out":21}
{"sheet":"Proj Info (B)","index":9,"n_rows":31,"n_cols":23,"rows_kept":31,"cut":false,"hidden":false,"merged":[[27,3,27,20],[28,3,28,20],[29,3,29,20],[30,3,30,20],[31,3,31,20],[26,3,26,20],[5,2,5,20],[6,5,6,12],[9,3,9,9],[12,3,12,20],[13,3,24,20]]}
[]
[null,{"$f":"'Applicant Info'!D6","v":"HOME-ARP APPLICATION"},null,null,null,null,null,null,null,null,null,null,null,null,null,null,null,null,null,null,null,null,{"$f":"'Applicant Info'!E12","v":"FY 2024 "}]
[]
[null,"IV.   PROJECT INFORMATION (Section B)"]
[null,null,"Program Plan and Narratives (10 pts)",null,null,null,null,null,null,null,null,null,null,null,null,null,null,null,null,null,{"$f":"Eligibility!O5","v":"Supportive Services and Tenant Based Rental Assistance"}]
[null,null,"The Project Information section, as well as the Project Description, must accurately describe the proposed project and how the requested ARP funds will be used.  Applicants must provide clear and concise answers to all questions."]
[null,null,{"$f":"IF('Applicant Info'!E20=\"\",\"\",'Applicant Info'!E20)","v":""}]
[]
[null,null,"Services"]
[]
{"$rows_left_out":22}
{"sheet":"Proj Info (C)","index":10,"n_rows":37,"n_cols":23,"rows_kept":37,"cut":false,"hidden":false,"merged":[[37,3,37,20],[39,3,39,13],[39,16,39,17],[28,3,28,20],[30,3,30,20],[31,3,31,20],[33,3,33,20],[34,3,34,20],[36,3,36,20],[27,3,27,20],[3,1,3,22],[4,1,4,22],[12,3,12,9],[24,3,24,20],[25,3,25,20]]}
[]
[null,{"$f":"'Applicant Info'!D6","v":"HOME-ARP APPLICATION"},null,null,null,null,null,null,null,null,null,null,null,null,null,null,null,null,null,null,null,null,{"$f":"'Applicant Info'!E12","v":"FY 2024 "}]
[]
[null,"IV.   PROJECT INFO (Section C)"]
[null,"The Project Information section as well as the Project Narrative must accurately describe the proposed project and how the requested ARP funds will be used.  Applicants must provide clear and concise answers to all questions."]
[null,null,"Program Plan and Narratives (10 pts)",null,null,null,null,null,null,null,null,null,null,null,null,null,null,null,null,null,{"$f":"Eligibility!O5","v":"Supportive Services and Tenant Based Rental Assistance"}]
[]
[null,null,{"$f":"IF('Applicant Info'!E20=\"\",\"\",'Applicant Info'!E20)","v":""}]
[]
[null,null,"Qualifying Populations"]
{"$rows_left_out":28}
{"sheet":"Proj Info (D)","index":11,"n_rows":26,"n_cols":20,"rows_kept":26,"cut":false,"hidden":false,"merged":[[26,3,26,17],[4,1,4,19],[19,3,19,17],[20,3,20,17],[22,3,22,17],[23,3,23,17],[25,3,25,17]]}
[]
[null,{"$f":"Eligibility!B2","v":"HOME-ARP APPLICATION"},null,null,null,null,null,null,null,null,null,null,null,null,null,null,null,null,null,{"$f":"'Applicant Info'!E12","v":"FY 2024 "}]
[]
[null,"IV.   PROJECT INFO (Section D)"]
[null,"The Project Information section as well as the Project Narrative must accurately describe the proposed project and how the requested ARP funds will be used.  Applicants must provide clear and concise answers to all questions."]
[null,null,null,null,null,null,null,null,null,null,null,null,null,null,null,null,null,"Tenant Based Rental Assistance"]
[]
[null,null,{"$f":"IF('Applicant Info'!E20=\"\",\"\",'Applicant Info'!E20)","v":""}]
[]
[null,null,"TBRA"]
{"$rows_left_out":17}
{"sheet":"Proj Info (E)","index":12,"n_rows":12,"n_cols":21,"rows_kept":12,"cut":false,"hidden":false,"merged":[[3,1,3,20],[4,1,4,20],[11,3,11,18],[12,3,15,18],[19,3,19,13]]}
[]
[null,{"$f":"Eligibility!B2","v":"HOME-ARP APPLICATION"},null,null,null,null,null,null,null,null,null,null,null,null,null,null,null,null,null,null,{"$f":"'Applicant Info'!E12","v":"FY 2024 "}]
[]
[null,"IV.   PROJECT INFO (Section E)"]
[null,"The Project Information section as well as the Project Narrative must accurately describe the proposed project and how the requested ARP funds will be used.  Applicants must provide clear and concise answers to all questions."]
[null,null,"Reporting Ability (5 pts)",null,null,null,null,null,null,null,null,null,null,null,null,null,null,null,{"$f":"Eligibility!O5","v":"Supportive Services and Tenant Based Rental Assistance"}]
[]
[null,null,{"$f":"IF('Applicant Info'!E20=\"\",\"\",'Applicant Info'!E20)","v":""}]
[]
[null,null,"B.  Reporting System"]
{"$rows_left_out":3}
{"sheet":" Needs Analysis","index":13,"n_rows":22,"n_cols":16,"rows_kept":22,"cut":false,"hidden":false,"merged":[[12,2,13,2],[12,13,12,14],[12,3,12,4],[12,5,12,6],[12,8,13,8],[12,9,13,9],[12,10,13,10],[12,11,12,12],[1,1,1,16],[2,1,2,16],[7,3,8,10],[10,2,10,15],[11,3,11,7],[11,8,11,10],[11,11,11,15]]}
[]
[null,"V.   NEEDS ANALYSIS"]
[null,"Proposed Performance Outcome Measurement should reflect the needs and goals expected to be met during the activity period.  "]
[null,"Need or Extent of Problem (15 pts)",null,null,null,null,null,null,null,null,null,null,null,null,null,{"$f":"Eligibility!O5","v":"Supportive Services and Tenant Based Rental Assistance"}]
[]
[null,{"$f":"IF('Applicant Info'!E20=\"\",\"\",'Applicant Info'!E20)","v":""}]
[null,null,null,"Homeless Needs Inventory and Gap Analysis Table"]
[null,null,null,"Evaluate the size and demographic composition of qualifying populations within the area you propose to serve. Applicants should use current data, including the Point In Time count, Coordinated Entry Data, or other data available through CoCs.\nSee notes in the cell for more information. "]
[]
[]
{"$rows_left_out":13}
{"sheet":"Proposed Goals","index":14,"n_rows":28,"n_cols":20,"rows_kept":28,"cut":false,"hidden":false,"merged":[[13,3,13,8],[14,3,14,7],[15,3,15,8],[20,2,20,18],[22,9,22,10],[22,11,22,12],[22,13,22,14],[22,15,22,16],[22,17,22,18],[3,1,3,19],[4,1,4,19],[9,2,9,19],[11,9,11,10],[11,11,11,12],[11,13,11,14],[11,15,11,16],[11,17,11,18]]}
[]
[null,{"$f":"Eligibility!B2","v":"HOME-ARP APPLICATION"},null,null,null,null,null,null,null,null,null,null,null,null,null,null,null,null,null,{"$f":"'Applicant Info'!E12","v":"FY 2024 "}]
[]
[null,"VI.   PROPOSED GOALS & OUTCOME MEASUREMENTS"]
[null,"Proposed Performance Outcome Measurement should reflect the needs and goals expected to be met during the activity period. "]
[null,null,"Program Goals (10 pts)",null,null,null,null,null,null,null,null,null,null,null,null,null,null,null,{"$f":"Eligibility!O5","v":"Supportive Services and Tenant Based Rental Assistance"}]
[]
[null,null,{"$f":"IF('Applicant Info'!E20=\"\",\"\",'Applicant Info'!E20)","v":""}]
[null,null,"Persons/Households to be Served"]
[null,null,"Enter the expected outcome for the number of persons and/or households (HH) to be served within the grant period for each quarter."]
{"$rows_left_out":19}
{"sheet":"Project Budget","index":15,"n_rows":77,"n_cols":12,"rows_kept":77,"cut":false,"hidden":false,"merged":[[71,2,71,5],[72,2,72,5],[60,2,60,6],[61,2,61,6],[62,2,62,6],[63,2,63,6],[64,2,64,6],[69,2,70,6],[59,2,59,6],[44,2,44,6],[45,2,45,6],[46,2,46,6],[47,2,47,6],[48,2,48,6],[52,2,53,6],[54,2,54,6],[55,2,55,6],[56,2,56,6],[57,2,57,6],[58,2,58,6],[43,2,43,6],[28,2,28,6],[29,2,29,6],[30,2,30,6],[31,2,31,6],[32,2,32,6],[35,2,35,6],[38,2,38,6],[39,2,39,6],[40,2,40,6],[41,2,41,6],[42,2,42,6],[27,2,27,6],[4,1,4,11],[8,1,8,10],[10,2,10,11],[12,3,12,4],[13,3,13,4],[19,2,19,6],[22,2,22,6],[23,2,23,6],[24,2,24,6],[25,2,25,6],[26,2,26,6]]}
[]
[null,{"$f":"Eligibility!B2","v":"HOME-ARP APPLICATION"},null,null,null,null,null,null,null,null,null,{"$f":"'Applicant Info'!E12","v":"FY 2024 "}]
[]
[null,"VII.  PROJECT BUDGET "]
[null,"The HOME-ARP funding must be used in coordination with other funding sources and programs to ensure a continuum of services.  The Proposed Budget must provide information on the organization's activities, resources, and expenditures projected for 2023-2024.  Complete as accurately and completely as possible.  Failure to do so may result in a reduction or denial of funding.\n\n *Agencies may not receive the complete amount of requested funding, including indirect costs."]
[null,null,"Financial Controls (8 pts)",null,null,null,null,null,null,null,{"$f":"Eligibility!O5","v":"Supportive Services and Tenant Based Rental Assistance"}]
[]
[null,null,{"$f":"IF('Applicant Info'!E20=\"\",\"\",'Applicant Info'!E20)","v":""}]
[]
[null,null,"Funding Request"]
{"$rows_left_out":68}
{"sheet":"Budget Summary","index":16,"n_rows":39,"n_cols":12,"rows_kept":39,"cut":false,"hidden":false,"merged":[[28,2,28,8],[4,1,4,11],[9,2,9,8],[16,2,16,8],[19,2,19,9],[25,2,25,9]]}
[]
[null,{"$f":"Eligibility!B2","v":"HOME-ARP APPLICATION"},null,null,null,null,null,null,null,null,null,{"$f":"'Applicant Info'!E12","v":"FY 2024 "}]
[]
[null,"VIII.  BUDGET SUMMARY"]
[null,"The HOME-ARP must be used in coordination with other funding sources and programs to ensure a continuum of services.  The Proposed Budget must provide information on the organization's activities, resources, and expenditures projected for 2024-2025.  Complete as accurately and completely as possible.  Failure to do so may result in a reduction or denial of funding.\n\n *Agencies may not receive the complete amount of requested funding, including indirect costs."]
[null,null,"Sound Budget (7 pts)",null,null,null,null,null,null,null,{"$f":"Eligibility!O5","v":"Supportive Services and Tenant Based Rental Assistance"}]
[]
[null,null,{"$f":"IF('Applicant Info'!E20=\"\",\"\",'Applicant Info'!E20)","v":""}]
[]
[null,null,"Anticipated Resources",null,null,null,null,null,null,null,"Amount Projected"]
{"$rows_left_out":30}
{"sheet":"Capacity and Experience","index":17,"n_rows":42,"n_cols":12,"rows_kept":42,"cut":false,"hidden":false,"merged":[[29,3,29,4],[24,2,25,2],[24,3,25,4],[24,5,25,5],[24,6,25,6],[24,9,25,9],[24,10,25,10],[26,3,26,4],[27,3,27,4],[28,3,28,4],[24,7,25,7],[24,8,25,8],[41,4,41,7],[41,9,41,10],[30,3,30,4],[31,3,31,4],[32,3,32,4],[33,3,33,4],[36,2,36,10],[37,2,37,3],[38,2,38,10],[39,2,39,10],[40,4,40,7],[40,9,40,10],[17,2,17,3],[17,4,17,8],[18,2,18,3],[18,4,18,8],[19,2,19,3],[19,4,19,8],[12,2,12,3],[12,4,12,10],[13,2,13,3],[13,4,13,10],[14,2,14,3],[14,4,14,5],[14,7,14,10],[3,1,3,11],[4,1,4,11],[6,2,7,10],[8,2,8,10],[11,2,11,3],[11,4,11,10]]}
[]
[null,{"$f":"Eligibility!B2","v":"HOME-ARP APPLICATION"},null,null,null,null,null,null,null,null,null,{"$f":"'Applicant Info'!E12","v":"FY 2024 "}]
[]
[null,"IX. Capacity and Experience"]
[]
[null,"","Capacity and Experience (20 pts)"]
[null,null,"APPLICANT EXPERIENCE & CAPACITY"]
[]
[null,null,"Mississippi Home Corporation (MHC) gives point preference to applicants whose key staff members (Executive Director, Case Manager and Finance Staff) have previous experience in managing projects with federal, state and local funding sources.  Applicants may receive up to fifteen (15) points based on the number of years of experience. MHC reserves the right to verify all information."]
[]
{"$rows_left_out":33}
{"sheet":"Certification","index":18,"n_rows":17,"n_cols":14,"rows_kept":17,"cut":false,"hidden":false,"merged":[[3,1,3,13],[4,1,4,13],[8,2,8,12],[12,3,12,9],[14,4,14,7]]}
[]
[null,{"$f":"Eligibility!B2","v":"HOME-ARP APPLICATION"},null,null,null,null,null,null,null,null,null,null,null,{"$f":"'Applicant Info'!E12","v":"FY 2024 "}]
[]
[null,"X.   CERTIFICATION"]
[]
[null,null,null,null,null,null,null,null,null,null,null,null,{"$f":"Eligibility!O5","v":"Supportive Services and Tenant Based Rental Assistance"}]
[]
[]
[null,null,"The Applicant certifies that all information in this application and all information furnished in support of this application is given for the purpose of obtaining funds under the HOME-ARP Program and is true and complete to the best of the Applicant's knowledge and belief.  The Applicant shall not, in the provisions of services, or in any other manner, discriminate against any person on the basis of race, color, creed, religion, sex, national origin, age, familial status or handicap.  Verification of any of the information contained in this application may be obtained from any source  named herein."]
[]
{"$rows_left_out":8}
{"sheet":"Project Budget SS","index":19,"n_rows":48,"n_cols":9,"rows_kept":48,"cut":false,"hidden":false,"merged":[[47,7,47,8],[3,7,3,8],[6,2,6,7],[12,2,12,7],[29,2,29,7],[42,2,43,2],[42,3,43,3],[42,4,43,4],[42,5,43,5],[42,6,43,6],[42,7,43,7]]}
[]
[null,{"$f":"Eligibility!B2","v":"HOME-ARP APPLICATION"},null,null,null,null,null,null,{"$f":"'Applicant Info'!E12","v":"FY 2024 "}]
[]
[null,null,null,null,null,null,null,"<<Go Back"]
[]
[]
[null,null,"Projected Project Expenses"]
[null,null,"Supportive Services (42 U.S.C.11360(29);b)"]
[]
[null,null,{"$f":"'Applicant Info'!E20","v":0}]
{"$rows_left_out":39}
{"sheet":"Project Budget TBRA","index":20,"n_rows":22,"n_cols":8,"rows_kept":22,"cut":false,"hidden":false,"merged":[[21,7,21,8],[1,1,1,2],[1,7,1,8],[3,7,3,8],[6,2,6,7],[12,2,12,7]]}
[]
[null,{"$f":"Eligibility!B2","v":"HOME-ARP APPLICATION"},null,null,null,null,null,{"$f":"'Applicant Info'!E12","v":"FY 2024 "}]
[]
[null,null,null,null,null,null,null,"<<Go Back"]
[]
[]
[null,null,"Projected Project Expenses"]
[null,null,"Tenant Based Rental Assistance"]
[]
[null,null,{"$f":"'Applicant Info'!E20","v":0}]
{"$rows_left_out":13}
{"sheet":"Factors.","index":21,"n_rows":88,"n_cols":22,"rows_kept":88,"cut":false,"hidden":true,"merged":[]}
[]
[]
[]
[null,"activity_type",null,null,null,null,"Counties",null,null,null,"employment",null,null,null,"support_docs",null,null,null,null,"app_yr",null,"yn"]
[]
[null,"Emergency Shelter",null,null,null,null,1,null,null,null,"Part-time",null,null,null,"Commitment Letter",null,null,null,null,2023,null,"Yes"]
[null,"Street Outreach",null,null,null,null,{"$f":"G6+1","v":2},"Adams",null,null,"Full-Time",null,null,null,"Award Letter",null,null,null,null,2024,null,"No"]
[null,"Rapid-Re-housing",null,null,null,null,3,"Alcorn",null,null,null,null,null,null,"Bank Statement"]
[null,"Homelessness Prevention",null,null,null,null,4,"Amite",null,null,null,null,null,null,"Other (Explain in Project Narrative)"]
[null,"HMIS",null,null,null,null,5,"Attala"]
{"$rows_left_out":78}